{"conditions": [
        {
            "text": "%x is within %y metres of %z",
            "category": "location",
            "x": {
                "type": "freetext",
                "value": "",
                "examples": ["Artist", "Venue", "Ticket Holder"]
            },
            "y": {
                "type": "number",
                "value": "",
                "examples": ["10", "100", "1000"]
            },
            "z": {
                "type": "freetext",
                "value": "",
                "examples": ["Artist", "Venue", "Ticket Holder"]
            }
        },
        {
            "text": "%x is within %y metres of %z",
            "category": "location",
            "x": {
                "type": "freetext",
                "value": "",
                "examples": ["Artist", "Venue", "Ticket Holder"]
            },
            "y": {
                "type": "number",
                "value": "",
                "examples": ["10", "100", "1000"]
            },
            "z": {
                "type": "freetext",
                "value": "",
                "examples": ["Artist", "Venue", "Ticket Holder"]
            }
        }
    ]
}